10 Replies Latest reply on Aug 30, 2018 8:46 PM by rseedle_2385561

    Updated version of AN56377

    rseedle_2385561

      Is there an up to date document similiar to AN56377, that shows how to send bulk and interrupt USB messages that builds on PSOC5 Creator 4.1 ? It doesn't appear AN56377 has been updated recently to support PSOC Creator 4.1 .

        • 1. Re: Updated version of AN56377
          anks

          You just need to use "Update Components" option   to get the AN56377's  projects successfully build in PSoC Creator 4.1.

          Are you encountering any application specific issue with the projects in Creator4.1

          • 2. Re: Updated version of AN56377
            rseedle_2385561

            It appears that the updating did catch everything. See the attached build output.

             

            Randy

               On Thursday, August 23, 2018, 2:10:15 AM CDT, anks <community-manager@cypress.com> wrote: 

             

              #yiv8642688691 * #yiv8642688691 a #yiv8642688691 body {font-family:Helvetica, Arial, sans-serif;}#yiv8642688691 #yiv8642688691 h1, #yiv8642688691 h2, #yiv8642688691 h3, #yiv8642688691 h4, #yiv8642688691 h5, #yiv8642688691 h6, #yiv8642688691 p, #yiv8642688691 hr {}#yiv8642688691 .yiv8642688691button td {}

            |

             

              Cypress Developer Community 

             

             

             

            |

            Updated version of AN56377

             

            reply from anks in PSoC 5LP MCU Community - View the full discussion

             

            You just need to use "Update Components" option   to get the  AN56377's  project successfully build in Creator 4.1.

             

            Are you encountering any application specific issue with the projects in Creator4.1

             

            Reply to this message by replying to this email, or go to the message on Cypress Developer Community

            Start a new discussion in PSoC 5LP MCU Community by email or at Cypress Developer Community

            Following Updated version of AN56377 in these streams: Inbox

             

             

            This email was sent by Cypress Developer Community because you are a registered user.

            You may unsubscribe instantly from Cypress Developer Community, or adjust email frequency in your email preferences

               

             

             

             

               

             

            Virus-free. www.avg.com

             

            • 3. Re: Updated version of AN56377
              anks

              I assume you are able to build the  AN56377's  projects successfully in PSoC Creator 4.1 now and no other issue with them

              • 4. Re: Updated version of AN56377
                rseedle_2385561

                Actually I am going from Creator 3.1 to Creator 4.1 . And no, the build is not correct. See the build log below.

                 

                Randy

                 

                --------------- Build Succeeded: 08/23/2018 14:44:58 ---------------

                --------------- Build Started: 08/23/2018 14:45:37 Project: Project 3, Configuration: ARM GCC 5.4-2016-q2-update Debug ---------------

                cydsfit.exe -.appdatapath "C:\Users\Randy\AppData\Local\Cypress Semiconductor\PSoC Creator\4.1" -.fdsnotice -.fdswarpdepfile=warp_dependencies.txt -.fdselabdepfile=elab_dependencies.txt -.fdsbldfile=generated_files.txt -.fdsreffile=referenced_files.txt -p "C:\temp\PSOC 5\AN56377(PSoC Creator 3.0)\AN56377\Project 3.cydsn\Project 3.cyprj" -d CY8C5868AXI-LP035 -s "C:\temp\PSOC 5\AN56377(PSoC Creator 3.0)\AN56377\Project 3.cydsn\Generated_Source\PSoC5" -- -yv2 -q10 -ygs -o2 -v3 -.fftcfgtype=LE

                Elaborating Design...

                ADD: sdb.M0033: error: The instance 'USBFS', of component USBFS_v2_70, contains an error. Unable to locate and customize component 'USBFS_v2_70' used in schematic 'C:\temp\PSOC 5\AN56377(PSoC Creator 3.0)\AN56377\Project 3.cydsn\TopDesign\TopDesign.cysch'.

                *  (Component Update Tool)

                * C:\temp\PSOC 5\AN56377(PSoC Creator 3.0)\AN56377\Project 3.cydsn\TopDesign\TopDesign.cysch (Instance:USBFS)

                Error: fit.M0050: The fitter aborted due to errors, please address all errors and rebuild. (App=cydsfit)

                --------------- Build Failed: 08/23/2018 14:45:40 ---------------

                --------------- Build Started: 08/23/2018 14:45:40 Project: Project 2, Configuration: ARM GCC 5.4-2016-q2-update Debug ---------------

                cydsfit.exe -.appdatapath "C:\Users\Randy\AppData\Local\Cypress Semiconductor\PSoC Creator\4.1" -.fdsnotice -.fdswarpdepfile=warp_dependencies.txt -.fdselabdepfile=elab_dependencies.txt -.fdsbldfile=generated_files.txt -.fdsreffile=referenced_files.txt -p "C:\temp\PSOC 5\AN56377(PSoC Creator 3.0)\AN56377\Project 2.cydsn\Project 2.cyprj" -d CY8C5868AXI-LP035 -s "C:\temp\PSOC 5\AN56377(PSoC Creator 3.0)\AN56377\Project 2.cydsn\Generated_Source\PSoC5" -- -yv2 -q10 -ygs -o2 -v3 -.fftcfgtype=LE

                Elaborating Design...

                ADD: sdb.M0033: error: The instance 'USBFS', of component USBFS_v2_70, contains an error. Unable to locate and customize component 'USBFS_v2_70' used in schematic 'C:\temp\PSOC 5\AN56377(PSoC Creator 3.0)\AN56377\Project 2.cydsn\TopDesign\TopDesign.cysch'.

                *  (Component Update Tool)

                * C:\temp\PSOC 5\AN56377(PSoC Creator 3.0)\AN56377\Project 2.cydsn\TopDesign\TopDesign.cysch (Instance:USBFS)

                ADD: sdb.M0033: error: The instance 'LED_1', of component cy_pins_v2_5, contains an error. Unable to locate and customize component 'cy_pins_v2_5' used in schematic 'C:\temp\PSOC 5\AN56377(PSoC Creator 3.0)\AN56377\Project 2.cydsn\TopDesign\TopDesign.cysch'.

                *  (Component Update Tool)

                * C:\temp\PSOC 5\AN56377(PSoC Creator 3.0)\AN56377\Project 2.cydsn\TopDesign\TopDesign.cysch (Instance:LED_1)

                ADD: sdb.M0033: error: The instance 'LED_2', of component cy_pins_v2_5, contains an error. Unable to locate and customize component 'cy_pins_v2_5' used in schematic 'C:\temp\PSOC 5\AN56377(PSoC Creator 3.0)\AN56377\Project 2.cydsn\TopDesign\TopDesign.cysch'.

                *  (Component Update Tool)

                * C:\temp\PSOC 5\AN56377(PSoC Creator 3.0)\AN56377\Project 2.cydsn\TopDesign\TopDesign.cysch (Instance:LED_2)

                Error: fit.M0050: The fitter aborted due to errors, please address all errors and rebuild. (App=cydsfit)

                --------------- Build Failed: 08/23/2018 14:45:42 ---------------

                --------------- Build Started: 08/23/2018 14:45:42 Project: Project 1, Configuration: ARM GCC 5.4-2016-q2-update Debug ---------------

                The code generation step is up to date.

                The compile step is up to date, no work needs to be done.

                The link step is up to date, no work needs to be done.

                --------------- Build Succeeded: 08/23/2018 14:45:43 ---------------

                --------------- Build Started: 08/23/2018 14:47:36 Project: Project 3, Configuration: ARM GCC 5.4-2016-q2-update Debug ---------------

                cydsfit.exe -.appdatapath "C:\Users\Randy\AppData\Local\Cypress Semiconductor\PSoC Creator\4.1" -.fdsnotice -.fdswarpdepfile=warp_dependencies.txt -.fdselabdepfile=elab_dependencies.txt -.fdsbldfile=generated_files.txt -.fdsreffile=referenced_files.txt -p "C:\temp\PSOC 5\AN56377(PSoC Creator 3.0)\AN56377\Project 3.cydsn\Project 3.cyprj" -d CY8C5868AXI-LP035 -s "C:\temp\PSOC 5\AN56377(PSoC Creator 3.0)\AN56377\Project 3.cydsn\Generated_Source\PSoC5" -- -yv2 -q10 -ygs -o2 -v3 -.fftcfgtype=LE

                Elaborating Design...

                ADD: sdb.M0033: error: The instance 'USBFS', of component USBFS_v2_70, contains an error. Unable to locate and customize component 'USBFS_v2_70' used in schematic 'C:\temp\PSOC 5\AN56377(PSoC Creator 3.0)\AN56377\Project 3.cydsn\TopDesign\TopDesign.cysch'.

                *  (Component Update Tool)

                * C:\temp\PSOC 5\AN56377(PSoC Creator 3.0)\AN56377\Project 3.cydsn\TopDesign\TopDesign.cysch (Instance:USBFS)

                Error: fit.M0050: The fitter aborted due to errors, please address all errors and rebuild. (App=cydsfit)

                --------------- Build Failed: 08/23/2018 14:47:38 ---------------

                --------------- Build Started: 08/23/2018 14:47:38 Project: Project 2, Configuration: ARM GCC 5.4-2016-q2-update Debug ---------------

                cydsfit.exe -.appdatapath "C:\Users\Randy\AppData\Local\Cypress Semiconductor\PSoC Creator\4.1" -.fdsnotice -.fdswarpdepfile=warp_dependencies.txt -.fdselabdepfile=elab_dependencies.txt -.fdsbldfile=generated_files.txt -.fdsreffile=referenced_files.txt -p "C:\temp\PSOC 5\AN56377(PSoC Creator 3.0)\AN56377\Project 2.cydsn\Project 2.cyprj" -d CY8C5868AXI-LP035 -s "C:\temp\PSOC 5\AN56377(PSoC Creator 3.0)\AN56377\Project 2.cydsn\Generated_Source\PSoC5" -- -yv2 -q10 -ygs -o2 -v3 -.fftcfgtype=LE

                Elaborating Design...

                ADD: sdb.M0033: error: The instance 'USBFS', of component USBFS_v2_70, contains an error. Unable to locate and customize component 'USBFS_v2_70' used in schematic 'C:\temp\PSOC 5\AN56377(PSoC Creator 3.0)\AN56377\Project 2.cydsn\TopDesign\TopDesign.cysch'.

                *  (Component Update Tool)

                * C:\temp\PSOC 5\AN56377(PSoC Creator 3.0)\AN56377\Project 2.cydsn\TopDesign\TopDesign.cysch (Instance:USBFS)

                ADD: sdb.M0033: error: The instance 'LED_1', of component cy_pins_v2_5, contains an error. Unable to locate and customize component 'cy_pins_v2_5' used in schematic 'C:\temp\PSOC 5\AN56377(PSoC Creator 3.0)\AN56377\Project 2.cydsn\TopDesign\TopDesign.cysch'.

                *  (Component Update Tool)

                * C:\temp\PSOC 5\AN56377(PSoC Creator 3.0)\AN56377\Project 2.cydsn\TopDesign\TopDesign.cysch (Instance:LED_1)

                ADD: sdb.M0033: error: The instance 'LED_2', of component cy_pins_v2_5, contains an error. Unable to locate and customize component 'cy_pins_v2_5' used in schematic 'C:\temp\PSOC 5\AN56377(PSoC Creator 3.0)\AN56377\Project 2.cydsn\TopDesign\TopDesign.cysch'.

                *  (Component Update Tool)

                * C:\temp\PSOC 5\AN56377(PSoC Creator 3.0)\AN56377\Project 2.cydsn\TopDesign\TopDesign.cysch (Instance:LED_2)

                Error: fit.M0050: The fitter aborted due to errors, please address all errors and rebuild. (App=cydsfit)

                --------------- Build Failed: 08/23/2018 14:47:41 ---------------

                --------------- Build Started: 08/23/2018 14:47:41 Project: Project 1, Configuration: ARM GCC 5.4-2016-q2-update Debug ---------------

                The code generation step is up to date.

                The compile step is up to date, no work needs to be done.

                The link step is up to date, no work needs to be done.

                --------------- Build Succeeded: 08/23/2018 14:47:41 ---------------

                • 5. Re: Updated version of AN56377
                  anks

                  Please find the attached archive of AN56377 project's which builds successfully in PSoC Creator  4.1 Update 1 (4.1.0.3210)

                  • 6. Re: Updated version of AN56377
                    rseedle_2385561

                    No the attached download did "not" build on my system. See the attached build errors.

                     

                    Randy

                     

                    --------------- Build Started: 08/28/2018 13:55:31 Project: Project 3, Configuration: ARM GCC 5.4-2016-q2-update Debug ---------------

                    cydsfit.exe -.appdatapath "C:\Users\Randy\AppData\Local\Cypress Semiconductor\PSoC Creator\4.1" -.fdsnotice -.fdswarpdepfile=warp_dependencies.txt -.fdselabdepfile=elab_dependencies.txt -.fdsbldfile=generated_files.txt -.fdsreffile=referenced_files.txt -p "C:\temp\PSOC 5\AN56377(PSoC Creator 3.0)\AN56377.cywrk.Archive01\AN56377\Project 3.cydsn\Project 3.cyprj" -d CY8C5868AXI-LP035 -s "C:\temp\PSOC 5\AN56377(PSoC Creator 3.0)\AN56377.cywrk.Archive01\AN56377\Project 3.cydsn\Generated_Source\PSoC5" -- -yv2 -q10 -ygs -o2 -v3 -.fftcfgtype=LE

                    Elaborating Design...

                    ADD: sdb.M0033: error: The instance 'USBFS', of component USBFS_v2_70, contains an error. Unable to locate and customize component 'USBFS_v2_70' used in schematic 'C:\temp\PSOC 5\AN56377(PSoC Creator 3.0)\AN56377.cywrk.Archive01\AN56377\Project 3.cydsn\TopDesign\TopDesign.cysch'.

                    *  (Component Update Tool)

                    * C:\temp\PSOC 5\AN56377(PSoC Creator 3.0)\AN56377.cywrk.Archive01\AN56377\Project 3.cydsn\TopDesign\TopDesign.cysch (Instance:USBFS)

                    Error: fit.M0050: The fitter aborted due to errors, please address all errors and rebuild. (App=cydsfit)

                    --------------- Build Failed: 08/28/2018 13:55:33 ---------------

                    --------------- Build Started: 08/28/2018 13:55:33 Project: Project 2, Configuration: ARM GCC 5.4-2016-q2-update Debug ---------------

                    cydsfit.exe -.appdatapath "C:\Users\Randy\AppData\Local\Cypress Semiconductor\PSoC Creator\4.1" -.fdsnotice -.fdswarpdepfile=warp_dependencies.txt -.fdselabdepfile=elab_dependencies.txt -.fdsbldfile=generated_files.txt -.fdsreffile=referenced_files.txt -p "C:\temp\PSOC 5\AN56377(PSoC Creator 3.0)\AN56377.cywrk.Archive01\AN56377\Project 2.cydsn\Project 2.cyprj" -d CY8C5868AXI-LP035 -s "C:\temp\PSOC 5\AN56377(PSoC Creator 3.0)\AN56377.cywrk.Archive01\AN56377\Project 2.cydsn\Generated_Source\PSoC5" -- -yv2 -q10 -ygs -o2 -v3 -.fftcfgtype=LE

                    Elaborating Design...

                    ADD: sdb.M0033: error: The instance 'USBFS', of component USBFS_v2_70, contains an error. Unable to locate and customize component 'USBFS_v2_70' used in schematic 'C:\temp\PSOC 5\AN56377(PSoC Creator 3.0)\AN56377.cywrk.Archive01\AN56377\Project 2.cydsn\TopDesign\TopDesign.cysch'.

                    *  (Component Update Tool)

                    * C:\temp\PSOC 5\AN56377(PSoC Creator 3.0)\AN56377.cywrk.Archive01\AN56377\Project 2.cydsn\TopDesign\TopDesign.cysch (Instance:USBFS)

                    ADD: sdb.M0033: error: The instance 'LED_1', of component cy_pins_v2_5, contains an error. Unable to locate and customize component 'cy_pins_v2_5' used in schematic 'C:\temp\PSOC 5\AN56377(PSoC Creator 3.0)\AN56377.cywrk.Archive01\AN56377\Project 2.cydsn\TopDesign\TopDesign.cysch'.

                    *  (Component Update Tool)

                    * C:\temp\PSOC 5\AN56377(PSoC Creator 3.0)\AN56377.cywrk.Archive01\AN56377\Project 2.cydsn\TopDesign\TopDesign.cysch (Instance:LED_1)

                    ADD: sdb.M0033: error: The instance 'LED_2', of component cy_pins_v2_5, contains an error. Unable to locate and customize component 'cy_pins_v2_5' used in schematic 'C:\temp\PSOC 5\AN56377(PSoC Creator 3.0)\AN56377.cywrk.Archive01\AN56377\Project 2.cydsn\TopDesign\TopDesign.cysch'.

                    *  (Component Update Tool)

                    * C:\temp\PSOC 5\AN56377(PSoC Creator 3.0)\AN56377.cywrk.Archive01\AN56377\Project 2.cydsn\TopDesign\TopDesign.cysch (Instance:LED_2)

                    Error: fit.M0050: The fitter aborted due to errors, please address all errors and rebuild. (App=cydsfit)

                    --------------- Build Failed: 08/28/2018 13:55:36 ---------------

                    --------------- Build Started: 08/28/2018 13:55:36 Project: Project 1, Configuration: ARM GCC 5.4-2016-q2-update Debug ---------------

                    cydsfit.exe -.appdatapath "C:\Users\Randy\AppData\Local\Cypress Semiconductor\PSoC Creator\4.1" -.fdsnotice -.fdswarpdepfile=warp_dependencies.txt -.fdselabdepfile=elab_dependencies.txt -.fdsbldfile=generated_files.txt -.fdsreffile=referenced_files.txt -p "C:\temp\PSOC 5\AN56377(PSoC Creator 3.0)\AN56377.cywrk.Archive01\AN56377\Project 1.cydsn\Project 1.cyprj" -d CY8C5868AXI-LP035 -s "C:\temp\PSOC 5\AN56377(PSoC Creator 3.0)\AN56377.cywrk.Archive01\AN56377\Project 1.cydsn\Generated_Source\PSoC5" -- -yv2 -q10 -ygs -o2 -v3 -.fftcfgtype=LE

                    Elaborating Design...

                    ADD: sdb.M0033: error: The instance 'USBFS', of component USBFS_v2_70, contains an error. Unable to locate and customize component 'USBFS_v2_70' used in schematic 'C:\temp\PSOC 5\AN56377(PSoC Creator 3.0)\AN56377.cywrk.Archive01\AN56377\Project 1.cydsn\TopDesign\TopDesign.cysch'.

                    *  (Component Update Tool)

                    * C:\temp\PSOC 5\AN56377(PSoC Creator 3.0)\AN56377.cywrk.Archive01\AN56377\Project 1.cydsn\TopDesign\TopDesign.cysch (Instance:USBFS)

                    Error: fit.M0050: The fitter aborted due to errors, please address all errors and rebuild. (App=cydsfit)

                    --------------- Build Failed: 08/28/2018 13:55:39 ---------------

                    • 7. Re: Updated version of AN56377
                      anks

                      From the log I can understand that the Creator is unable to  update the component's version as required in Creator4.1.That problem is easily resolved if you do "Update Components" for each project in the Work space and then give a build.

                       

                      Can you please share the Screenshot of "Update Components Tool"  that you are observing for projects in Creator4.1.

                       

                       

                      The previously attached workspace builds successfully on my system (having Windows7) in PSoC Creator  4.1 Update 1 (4.1.0.3210)

                      • 8. Re: Updated version of AN56377
                        rseedle_2385561

                        I find that when I update the components, project 1 actually does the update the components process. For projects 2 and 3 it thinks that the components are already updated. Then when you try to clean and build the projects, the project 1 builds, project 2 fails, and project 3 builds (which seems different to me, I thought it failed previously also).  See the attached images.

                         

                        Randy

                         

                        Project 1 updating components step 2.png

                         

                        Project 1 updating components.png

                         

                        Project 2 and 3.png

                         

                        --------------- Build Started: 08/29/2018 12:24:58 Project: Project 3, Configuration: ARM GCC 5.4-2016-q2-update Debug ---------------

                        cydsfit.exe -.appdatapath "C:\Users\Randy\AppData\Local\Cypress Semiconductor\PSoC Creator\4.1" -.fdsnotice -.fdswarpdepfile=warp_dependencies.txt -.fdselabdepfile=elab_dependencies.txt -.fdsbldfile=generated_files.txt -.fdsreffile=referenced_files.txt -p "C:\temp\PSOC 5\AN56377(PSoC Creator 3.0)\AN56377.cywrk.Archive01\AN56377\Project 3.cydsn\Project 3.cyprj" -d CY8C5868AXI-LP035 -s "C:\temp\PSOC 5\AN56377(PSoC Creator 3.0)\AN56377.cywrk.Archive01\AN56377\Project 3.cydsn\Generated_Source\PSoC5" -- -yv2 -q10 -ygs -o2 -v3 -.fftcfgtype=LE

                        Elaborating Design...

                        HDL Generation...

                        Synthesis...

                        Tech Mapping...

                        Analog Placement...

                        Analog Routing...

                        Analog Code Generation...

                        Digital Placement...

                        Digital Routing...

                        Bitstream Generation...

                        Bitstream Verification...

                        Static timing analysis...

                        API Generation...

                        Dependency Generation...

                        Cleanup...

                        arm-none-eabi-gcc.exe -mcpu=cortex-m3 -mthumb -I. -IGenerated_Source\PSoC5 -Wa,-alh=.\ARM_GCC_541\Debug/main.lst -g -Wall -ffunction-sections -ffat-lto-objects -finline-functions -O3 -c main.c -o .\ARM_GCC_541\Debug\main.o

                        main.c:62:6: warning: return type of 'main' is not 'int' [-Wmain]

                        void main (void)

                              ^

                        arm-none-eabi-gcc.exe -mcpu=cortex-m3 -mthumb -I. -IGenerated_Source\PSoC5 -Wa,-alh=.\ARM_GCC_541\Debug/cyfitter_cfg.lst -g -Wall -ffunction-sections -ffat-lto-objects -finline-functions -O3 -c Generated_Source\PSoC5\cyfitter_cfg.c -o .\ARM_GCC_541\Debug\cyfitter_cfg.o

                        arm-none-eabi-gcc.exe -mcpu=cortex-m3 -mthumb -I. -IGenerated_Source\PSoC5 -Wa,-alh=.\ARM_GCC_541\Debug/cymetadata.lst -g -Wall -ffunction-sections -ffat-lto-objects -finline-functions -O3 -c Generated_Source\PSoC5\cymetadata.c -o .\ARM_GCC_541\Debug\cymetadata.o

                        arm-none-eabi-gcc.exe -mcpu=cortex-m3 -mthumb -I. -IGenerated_Source\PSoC5 -Wa,-alh=.\ARM_GCC_541\Debug/USBFS.lst -g -Wall -ffunction-sections -ffat-lto-objects -finline-functions -O3 -c Generated_Source\PSoC5\USBFS.c -o .\ARM_GCC_541\Debug\USBFS.o

                        arm-none-eabi-gcc.exe -mcpu=cortex-m3 -mthumb -I. -IGenerated_Source\PSoC5 -Wa,-alh=.\ARM_GCC_541\Debug/USBFS_audio.lst -g -Wall -ffunction-sections -ffat-lto-objects -finline-functions -O3 -c Generated_Source\PSoC5\USBFS_audio.c -o .\ARM_GCC_541\Debug\USBFS_audio.o

                        arm-none-eabi-gcc.exe -mcpu=cortex-m3 -mthumb -I. -IGenerated_Source\PSoC5 -Wa,-alh=.\ARM_GCC_541\Debug/USBFS_boot.lst -g -Wall -ffunction-sections -ffat-lto-objects -finline-functions -O3 -c Generated_Source\PSoC5\USBFS_boot.c -o .\ARM_GCC_541\Debug\USBFS_boot.o

                        arm-none-eabi-gcc.exe -mcpu=cortex-m3 -mthumb -I. -IGenerated_Source\PSoC5 -Wa,-alh=.\ARM_GCC_541\Debug/USBFS_cdc.lst -g -Wall -ffunction-sections -ffat-lto-objects -finline-functions -O3 -c Generated_Source\PSoC5\USBFS_cdc.c -o .\ARM_GCC_541\Debug\USBFS_cdc.o

                        arm-none-eabi-gcc.exe -mcpu=cortex-m3 -mthumb -I. -IGenerated_Source\PSoC5 -Wa,-alh=.\ARM_GCC_541\Debug/USBFS_cls.lst -g -Wall -ffunction-sections -ffat-lto-objects -finline-functions -O3 -c Generated_Source\PSoC5\USBFS_cls.c -o .\ARM_GCC_541\Debug\USBFS_cls.o

                        arm-none-eabi-gcc.exe -mcpu=cortex-m3 -mthumb -I. -IGenerated_Source\PSoC5 -Wa,-alh=.\ARM_GCC_541\Debug/USBFS_descr.lst -g -Wall -ffunction-sections -ffat-lto-objects -finline-functions -O3 -c Generated_Source\PSoC5\USBFS_descr.c -o .\ARM_GCC_541\Debug\USBFS_descr.o

                        arm-none-eabi-gcc.exe -mcpu=cortex-m3 -mthumb -I. -IGenerated_Source\PSoC5 -Wa,-alh=.\ARM_GCC_541\Debug/USBFS_drv.lst -g -Wall -ffunction-sections -ffat-lto-objects -finline-functions -O3 -c Generated_Source\PSoC5\USBFS_drv.c -o .\ARM_GCC_541\Debug\USBFS_drv.o

                        arm-none-eabi-gcc.exe -mcpu=cortex-m3 -mthumb -I. -IGenerated_Source\PSoC5 -Wa,-alh=.\ARM_GCC_541\Debug/USBFS_episr.lst -g -Wall -ffunction-sections -ffat-lto-objects -finline-functions -O3 -c Generated_Source\PSoC5\USBFS_episr.c -o .\ARM_GCC_541\Debug\USBFS_episr.o

                        arm-none-eabi-gcc.exe -mcpu=cortex-m3 -mthumb -I. -IGenerated_Source\PSoC5 -Wa,-alh=.\ARM_GCC_541\Debug/USBFS_hid.lst -g -Wall -ffunction-sections -ffat-lto-objects -finline-functions -O3 -c Generated_Source\PSoC5\USBFS_hid.c -o .\ARM_GCC_541\Debug\USBFS_hid.o

                        arm-none-eabi-gcc.exe -mcpu=cortex-m3 -mthumb -I. -IGenerated_Source\PSoC5 -Wa,-alh=.\ARM_GCC_541\Debug/USBFS_pm.lst -g -Wall -ffunction-sections -ffat-lto-objects -finline-functions -O3 -c Generated_Source\PSoC5\USBFS_pm.c -o .\ARM_GCC_541\Debug\USBFS_pm.o

                        arm-none-eabi-gcc.exe -mcpu=cortex-m3 -mthumb -I. -IGenerated_Source\PSoC5 -Wa,-alh=.\ARM_GCC_541\Debug/USBFS_std.lst -g -Wall -ffunction-sections -ffat-lto-objects -finline-functions -O3 -c Generated_Source\PSoC5\USBFS_std.c -o .\ARM_GCC_541\Debug\USBFS_std.o

                        arm-none-eabi-gcc.exe -mcpu=cortex-m3 -mthumb -I. -IGenerated_Source\PSoC5 -Wa,-alh=.\ARM_GCC_541\Debug/USBFS_vnd.lst -g -Wall -ffunction-sections -ffat-lto-objects -finline-functions -O3 -c Generated_Source\PSoC5\USBFS_vnd.c -o .\ARM_GCC_541\Debug\USBFS_vnd.o

                        arm-none-eabi-gcc.exe -mcpu=cortex-m3 -mthumb -I. -IGenerated_Source\PSoC5 -Wa,-alh=.\ARM_GCC_541\Debug/USBFS_midi.lst -g -Wall -ffunction-sections -ffat-lto-objects -finline-functions -O3 -c Generated_Source\PSoC5\USBFS_midi.c -o .\ARM_GCC_541\Debug\USBFS_midi.o

                        arm-none-eabi-gcc.exe -mcpu=cortex-m3 -mthumb -I. -IGenerated_Source\PSoC5 -Wa,-alh=.\ARM_GCC_541\Debug/USBFS_msc.lst -g -Wall -ffunction-sections -ffat-lto-objects -finline-functions -O3 -c Generated_Source\PSoC5\USBFS_msc.c -o .\ARM_GCC_541\Debug\USBFS_msc.o

                        arm-none-eabi-gcc.exe -mcpu=cortex-m3 -mthumb -I. -IGenerated_Source\PSoC5 -Wa,-alh=.\ARM_GCC_541\Debug/USBFS_EP17_DMA_Done_SR.lst -g -Wall -ffunction-sections -ffat-lto-objects -finline-functions -O3 -c Generated_Source\PSoC5\USBFS_EP17_DMA_Done_SR.c -o .\ARM_GCC_541\Debug\USBFS_EP17_DMA_Done_SR.o

                        arm-none-eabi-gcc.exe -mcpu=cortex-m3 -mthumb -I. -IGenerated_Source\PSoC5 -Wa,-alh=.\ARM_GCC_541\Debug/USBFS_EP_DMA_Done_isr.lst -g -Wall -ffunction-sections -ffat-lto-objects -finline-functions -O3 -c Generated_Source\PSoC5\USBFS_EP_DMA_Done_isr.c -o .\ARM_GCC_541\Debug\USBFS_EP_DMA_Done_isr.o

                        arm-none-eabi-gcc.exe -mcpu=cortex-m3 -mthumb -I. -IGenerated_Source\PSoC5 -Wa,-alh=.\ARM_GCC_541\Debug/USBFS_EP8_DMA_Done_SR.lst -g -Wall -ffunction-sections -ffat-lto-objects -finline-functions -O3 -c Generated_Source\PSoC5\USBFS_EP8_DMA_Done_SR.c -o .\ARM_GCC_541\Debug\USBFS_EP8_DMA_Done_SR.o

                        arm-none-eabi-gcc.exe -mcpu=cortex-m3 -mthumb -I. -IGenerated_Source\PSoC5 -Wa,-alh=.\ARM_GCC_541\Debug/USBFS_ep1_dma.lst -g -Wall -ffunction-sections -ffat-lto-objects -finline-functions -O3 -c Generated_Source\PSoC5\USBFS_ep1_dma.c -o .\ARM_GCC_541\Debug\USBFS_ep1_dma.o

                        arm-none-eabi-gcc.exe -mcpu=cortex-m3 -mthumb -I. -IGenerated_Source\PSoC5 -Wa,-alh=.\ARM_GCC_541\Debug/USBFS_Dm.lst -g -Wall -ffunction-sections -ffat-lto-objects -finline-functions -O3 -c Generated_Source\PSoC5\USBFS_Dm.c -o .\ARM_GCC_541\Debug\USBFS_Dm.o

                        arm-none-eabi-gcc.exe -mcpu=cortex-m3 -mthumb -I. -IGenerated_Source\PSoC5 -Wa,-alh=.\ARM_GCC_541\Debug/USBFS_Dp.lst -g -Wall -ffunction-sections -ffat-lto-objects -finline-functions -O3 -c Generated_Source\PSoC5\USBFS_Dp.c -o .\ARM_GCC_541\Debug\USBFS_Dp.o

                        arm-none-eabi-gcc.exe -mcpu=cortex-m3 -mthumb -I. -IGenerated_Source\PSoC5 -Wa,-alh=.\ARM_GCC_541\Debug/Cm3Start.lst -g -Wall -ffunction-sections -ffat-lto-objects -finline-functions -O3 -c Generated_Source\PSoC5\Cm3Start.c -o .\ARM_GCC_541\Debug\Cm3Start.o

                        arm-none-eabi-gcc.exe -mcpu=cortex-m3 -mthumb -I. -IGenerated_Source\PSoC5 -Wa,-alh=.\ARM_GCC_541\Debug/CyDmac.lst -g -Wall -ffunction-sections -ffat-lto-objects -finline-functions -O3 -c Generated_Source\PSoC5\CyDmac.c -o .\ARM_GCC_541\Debug\CyDmac.o

                        arm-none-eabi-gcc.exe -mcpu=cortex-m3 -mthumb -I. -IGenerated_Source\PSoC5 -Wa,-alh=.\ARM_GCC_541\Debug/CyFlash.lst -g -Wall -ffunction-sections -ffat-lto-objects -finline-functions -O3 -c Generated_Source\PSoC5\CyFlash.c -o .\ARM_GCC_541\Debug\CyFlash.o

                        arm-none-eabi-gcc.exe -mcpu=cortex-m3 -mthumb -I. -IGenerated_Source\PSoC5 -Wa,-alh=.\ARM_GCC_541\Debug/CyLib.lst -g -Wall -ffunction-sections -ffat-lto-objects -finline-functions -O3 -c Generated_Source\PSoC5\CyLib.c -o .\ARM_GCC_541\Debug\CyLib.o

                        arm-none-eabi-gcc.exe -mcpu=cortex-m3 -mthumb -I. -IGenerated_Source\PSoC5 -Wa,-alh=.\ARM_GCC_541\Debug/cyPm.lst -g -Wall -ffunction-sections -ffat-lto-objects -finline-functions -O3 -c Generated_Source\PSoC5\cyPm.c -o .\ARM_GCC_541\Debug\cyPm.o

                        arm-none-eabi-gcc.exe -mcpu=cortex-m3 -mthumb -I. -IGenerated_Source\PSoC5 -Wa,-alh=.\ARM_GCC_541\Debug/CySpc.lst -g -Wall -ffunction-sections -ffat-lto-objects -finline-functions -O3 -c Generated_Source\PSoC5\CySpc.c -o .\ARM_GCC_541\Debug\CySpc.o

                        arm-none-eabi-gcc.exe -mcpu=cortex-m3 -mthumb -I. -IGenerated_Source\PSoC5 -Wa,-alh=.\ARM_GCC_541\Debug/cyutils.lst -g -Wall -ffunction-sections -ffat-lto-objects -finline-functions -O3 -c Generated_Source\PSoC5\cyutils.c -o .\ARM_GCC_541\Debug\cyutils.o

                        arm-none-eabi-as.exe -mcpu=cortex-m3 -mthumb -I. -IGenerated_Source\PSoC5 -alh=.\ARM_GCC_541\Debug/CyBootAsmGnu.lst -g -o .\ARM_GCC_541\Debug\CyBootAsmGnu.o Generated_Source\PSoC5\CyBootAsmGnu.s

                        arm-none-eabi-ar.exe -rs ".\ARM_GCC_541\Debug\Project 3.a" .\ARM_GCC_541\Debug\USBFS.o .\ARM_GCC_541\Debug\USBFS_audio.o .\ARM_GCC_541\Debug\USBFS_boot.o .\ARM_GCC_541\Debug\USBFS_cdc.o .\ARM_GCC_541\Debug\USBFS_cls.o .\ARM_GCC_541\Debug\USBFS_descr.o .\ARM_GCC_541\Debug\USBFS_drv.o .\ARM_GCC_541\Debug\USBFS_episr.o .\ARM_GCC_541\Debug\USBFS_hid.o .\ARM_GCC_541\Debug\USBFS_pm.o .\ARM_GCC_541\Debug\USBFS_std.o .\ARM_GCC_541\Debug\USBFS_vnd.o .\ARM_GCC_541\Debug\USBFS_midi.o .\ARM_GCC_541\Debug\USBFS_msc.o .\ARM_GCC_541\Debug\USBFS_EP17_DMA_Done_SR.o .\ARM_GCC_541\Debug\USBFS_EP_DMA_Done_isr.o .\ARM_GCC_541\Debug\USBFS_EP8_DMA_Done_SR.o .\ARM_GCC_541\Debug\USBFS_ep1_dma.o .\ARM_GCC_541\Debug\USBFS_Dm.o .\ARM_GCC_541\Debug\USBFS_Dp.o .\ARM_GCC_541\Debug\CyDmac.o .\ARM_GCC_541\Debug\CyFlash.o .\ARM_GCC_541\Debug\CyLib.o .\ARM_GCC_541\Debug\cyPm.o .\ARM_GCC_541\Debug\CySpc.o .\ARM_GCC_541\Debug\cyutils.o .\ARM_GCC_541\Debug\CyBootAsmGnu.o

                        arm-none-eabi-ar.exe: creating .\ARM_GCC_541\Debug\Project 3.a

                        arm-none-eabi-gcc.exe -Wl,--start-group -o "C:\temp\PSOC 5\AN56377(PSoC Creator 3.0)\AN56377.cywrk.Archive01\AN56377\Project 3.cydsn\ARM_GCC_541\Debug\Project 3.elf" .\ARM_GCC_541\Debug\main.o .\ARM_GCC_541\Debug\cyfitter_cfg.o .\ARM_GCC_541\Debug\cymetadata.o .\ARM_GCC_541\Debug\Cm3Start.o ".\ARM_GCC_541\Debug\Project 3.a" "C:\Program Files (x86)\Cypress\PSoC Creator\4.1\PSoC Creator\psoc\content\cycomponentlibrary\CyComponentLibrary.cylib\CortexM3\ARM_GCC_541\Debug\CyComponentLibrary.a" -mcpu=cortex-m3 -mthumb -L Generated_Source\PSoC5 "-Wl,-Map,.\ARM_GCC_541\Debug/Project 3.map" -T Generated_Source\PSoC5\cm3gcc.ld -specs=nano.specs -Wl,--gc-sections -g -ffunction-sections -finline-functions -O3 -ffat-lto-objects -Wl,--end-group

                        cyelftool.exe -C "C:\temp\PSOC 5\AN56377(PSoC Creator 3.0)\AN56377.cywrk.Archive01\AN56377\Project 3.cydsn\ARM_GCC_541\Debug\Project 3.elf" --flash_row_size 256 --flash_size 262144 --flash_offset 0x00000000

                        cyelftool.exe -S "C:\temp\PSOC 5\AN56377(PSoC Creator 3.0)\AN56377.cywrk.Archive01\AN56377\Project 3.cydsn\ARM_GCC_541\Debug\Project 3.elf"

                        Flash used: 8640 of 262144 bytes (3.3 %).

                        SRAM used: 3825 of 65536 bytes (5.8 %). Stack: 2048 bytes. Heap: 128 bytes.

                        --------------- Build Succeeded: 08/29/2018 12:25:29 ---------------

                        --------------- Build Started: 08/29/2018 12:25:29 Project: Project 2, Configuration: ARM GCC 5.4-2016-q2-update Debug ---------------

                        cydsfit.exe -.appdatapath "C:\Users\Randy\AppData\Local\Cypress Semiconductor\PSoC Creator\4.1" -.fdsnotice -.fdswarpdepfile=warp_dependencies.txt -.fdselabdepfile=elab_dependencies.txt -.fdsbldfile=generated_files.txt -.fdsreffile=referenced_files.txt -p "C:\temp\PSOC 5\AN56377(PSoC Creator 3.0)\AN56377.cywrk.Archive01\AN56377\Project 2.cydsn\Project 2.cyprj" -d CY8C5868AXI-LP035 -s "C:\temp\PSOC 5\AN56377(PSoC Creator 3.0)\AN56377.cywrk.Archive01\AN56377\Project 2.cydsn\Generated_Source\PSoC5" -- -yv2 -q10 -ygs -o2 -v3 -.fftcfgtype=LE

                        Elaborating Design...

                        ADD: sdb.M0033: error: The instance 'USBFS', of component USBFS_v2_70, contains an error. Unable to locate and customize component 'USBFS_v2_70' used in schematic 'C:\temp\PSOC 5\AN56377(PSoC Creator 3.0)\AN56377.cywrk.Archive01\AN56377\Project 2.cydsn\TopDesign\TopDesign.cysch'.

                        *  (Component Update Tool)

                        * C:\temp\PSOC 5\AN56377(PSoC Creator 3.0)\AN56377.cywrk.Archive01\AN56377\Project 2.cydsn\TopDesign\TopDesign.cysch (Instance:USBFS)

                        ADD: sdb.M0033: error: The instance 'LED_1', of component cy_pins_v2_5, contains an error. Unable to locate and customize component 'cy_pins_v2_5' used in schematic 'C:\temp\PSOC 5\AN56377(PSoC Creator 3.0)\AN56377.cywrk.Archive01\AN56377\Project 2.cydsn\TopDesign\TopDesign.cysch'.

                        *  (Component Update Tool)

                        * C:\temp\PSOC 5\AN56377(PSoC Creator 3.0)\AN56377.cywrk.Archive01\AN56377\Project 2.cydsn\TopDesign\TopDesign.cysch (Instance:LED_1)

                        ADD: sdb.M0033: error: The instance 'LED_2', of component cy_pins_v2_5, contains an error. Unable to locate and customize component 'cy_pins_v2_5' used in schematic 'C:\temp\PSOC 5\AN56377(PSoC Creator 3.0)\AN56377.cywrk.Archive01\AN56377\Project 2.cydsn\TopDesign\TopDesign.cysch'.

                        *  (Component Update Tool)

                        * C:\temp\PSOC 5\AN56377(PSoC Creator 3.0)\AN56377.cywrk.Archive01\AN56377\Project 2.cydsn\TopDesign\TopDesign.cysch (Instance:LED_2)

                        Error: fit.M0050: The fitter aborted due to errors, please address all errors and rebuild. (App=cydsfit)

                        --------------- Build Failed: 08/29/2018 12:25:32 ---------------

                        --------------- Build Started: 08/29/2018 12:25:32 Project: Project 1, Configuration: ARM GCC 5.4-2016-q2-update Debug ---------------

                        cydsfit.exe -.appdatapath "C:\Users\Randy\AppData\Local\Cypress Semiconductor\PSoC Creator\4.1" -.fdsnotice -.fdswarpdepfile=warp_dependencies.txt -.fdselabdepfile=elab_dependencies.txt -.fdsbldfile=generated_files.txt -.fdsreffile=referenced_files.txt -p "C:\temp\PSOC 5\AN56377(PSoC Creator 3.0)\AN56377.cywrk.Archive01\AN56377\Project 1.cydsn\Project 1.cyprj" -d CY8C5868AXI-LP035 -s "C:\temp\PSOC 5\AN56377(PSoC Creator 3.0)\AN56377.cywrk.Archive01\AN56377\Project 1.cydsn\Generated_Source\PSoC5" -- -yv2 -q10 -ygs -o2 -v3 -.fftcfgtype=LE

                        Elaborating Design...

                        HDL Generation...

                        Synthesis...

                        Tech Mapping...

                        Analog Placement...

                        Analog Routing...

                        Analog Code Generation...

                        Digital Placement...

                        Digital Routing...

                        Bitstream Generation...

                        Bitstream Verification...

                        Static timing analysis...

                        API Generation...

                        Dependency Generation...

                        Cleanup...

                        arm-none-eabi-gcc.exe -mcpu=cortex-m3 -mthumb -I. -IGenerated_Source\PSoC5 -Wa,-alh=.\CortexM3\ARM_GCC_541\Debug/main.lst -g -Wall -ffunction-sections -ffat-lto-objects -O0 -c main.c -o .\CortexM3\ARM_GCC_541\Debug\main.o

                        main.c:77:6: warning: return type of 'main' is not 'int' [-Wmain]

                        void main(void)

                              ^

                        arm-none-eabi-gcc.exe -mcpu=cortex-m3 -mthumb -I. -IGenerated_Source\PSoC5 -Wa,-alh=.\CortexM3\ARM_GCC_541\Debug/cyfitter_cfg.lst -g -Wall -ffunction-sections -ffat-lto-objects -O0 -c Generated_Source\PSoC5\cyfitter_cfg.c -o .\CortexM3\ARM_GCC_541\Debug\cyfitter_cfg.o

                        arm-none-eabi-gcc.exe -mcpu=cortex-m3 -mthumb -I. -IGenerated_Source\PSoC5 -Wa,-alh=.\CortexM3\ARM_GCC_541\Debug/cymetadata.lst -g -Wall -ffunction-sections -ffat-lto-objects -O0 -c Generated_Source\PSoC5\cymetadata.c -o .\CortexM3\ARM_GCC_541\Debug\cymetadata.o

                        arm-none-eabi-gcc.exe -mcpu=cortex-m3 -mthumb -I. -IGenerated_Source\PSoC5 -Wa,-alh=.\CortexM3\ARM_GCC_541\Debug/USBFS.lst -g -Wall -ffunction-sections -ffat-lto-objects -O0 -c Generated_Source\PSoC5\USBFS.c -o .\CortexM3\ARM_GCC_541\Debug\USBFS.o

                        arm-none-eabi-gcc.exe -mcpu=cortex-m3 -mthumb -I. -IGenerated_Source\PSoC5 -Wa,-alh=.\CortexM3\ARM_GCC_541\Debug/USBFS_audio.lst -g -Wall -ffunction-sections -ffat-lto-objects -O0 -c Generated_Source\PSoC5\USBFS_audio.c -o .\CortexM3\ARM_GCC_541\Debug\USBFS_audio.o

                        arm-none-eabi-gcc.exe -mcpu=cortex-m3 -mthumb -I. -IGenerated_Source\PSoC5 -Wa,-alh=.\CortexM3\ARM_GCC_541\Debug/USBFS_boot.lst -g -Wall -ffunction-sections -ffat-lto-objects -O0 -c Generated_Source\PSoC5\USBFS_boot.c -o .\CortexM3\ARM_GCC_541\Debug\USBFS_boot.o

                        arm-none-eabi-gcc.exe -mcpu=cortex-m3 -mthumb -I. -IGenerated_Source\PSoC5 -Wa,-alh=.\CortexM3\ARM_GCC_541\Debug/USBFS_cdc.lst -g -Wall -ffunction-sections -ffat-lto-objects -O0 -c Generated_Source\PSoC5\USBFS_cdc.c -o .\CortexM3\ARM_GCC_541\Debug\USBFS_cdc.o

                        arm-none-eabi-gcc.exe -mcpu=cortex-m3 -mthumb -I. -IGenerated_Source\PSoC5 -Wa,-alh=.\CortexM3\ARM_GCC_541\Debug/USBFS_cls.lst -g -Wall -ffunction-sections -ffat-lto-objects -O0 -c Generated_Source\PSoC5\USBFS_cls.c -o .\CortexM3\ARM_GCC_541\Debug\USBFS_cls.o

                        arm-none-eabi-gcc.exe -mcpu=cortex-m3 -mthumb -I. -IGenerated_Source\PSoC5 -Wa,-alh=.\CortexM3\ARM_GCC_541\Debug/USBFS_descr.lst -g -Wall -ffunction-sections -ffat-lto-objects -O0 -c Generated_Source\PSoC5\USBFS_descr.c -o .\CortexM3\ARM_GCC_541\Debug\USBFS_descr.o

                        arm-none-eabi-gcc.exe -mcpu=cortex-m3 -mthumb -I. -IGenerated_Source\PSoC5 -Wa,-alh=.\CortexM3\ARM_GCC_541\Debug/USBFS_drv.lst -g -Wall -ffunction-sections -ffat-lto-objects -O0 -c Generated_Source\PSoC5\USBFS_drv.c -o .\CortexM3\ARM_GCC_541\Debug\USBFS_drv.o

                        arm-none-eabi-gcc.exe -mcpu=cortex-m3 -mthumb -I. -IGenerated_Source\PSoC5 -Wa,-alh=.\CortexM3\ARM_GCC_541\Debug/USBFS_episr.lst -g -Wall -ffunction-sections -ffat-lto-objects -O0 -c Generated_Source\PSoC5\USBFS_episr.c -o .\CortexM3\ARM_GCC_541\Debug\USBFS_episr.o

                        arm-none-eabi-gcc.exe -mcpu=cortex-m3 -mthumb -I. -IGenerated_Source\PSoC5 -Wa,-alh=.\CortexM3\ARM_GCC_541\Debug/USBFS_hid.lst -g -Wall -ffunction-sections -ffat-lto-objects -O0 -c Generated_Source\PSoC5\USBFS_hid.c -o .\CortexM3\ARM_GCC_541\Debug\USBFS_hid.o

                        arm-none-eabi-gcc.exe -mcpu=cortex-m3 -mthumb -I. -IGenerated_Source\PSoC5 -Wa,-alh=.\CortexM3\ARM_GCC_541\Debug/USBFS_pm.lst -g -Wall -ffunction-sections -ffat-lto-objects -O0 -c Generated_Source\PSoC5\USBFS_pm.c -o .\CortexM3\ARM_GCC_541\Debug\USBFS_pm.o

                        arm-none-eabi-gcc.exe -mcpu=cortex-m3 -mthumb -I. -IGenerated_Source\PSoC5 -Wa,-alh=.\CortexM3\ARM_GCC_541\Debug/USBFS_std.lst -g -Wall -ffunction-sections -ffat-lto-objects -O0 -c Generated_Source\PSoC5\USBFS_std.c -o .\CortexM3\ARM_GCC_541\Debug\USBFS_std.o

                        arm-none-eabi-gcc.exe -mcpu=cortex-m3 -mthumb -I. -IGenerated_Source\PSoC5 -Wa,-alh=.\CortexM3\ARM_GCC_541\Debug/USBFS_vnd.lst -g -Wall -ffunction-sections -ffat-lto-objects -O0 -c Generated_Source\PSoC5\USBFS_vnd.c -o .\CortexM3\ARM_GCC_541\Debug\USBFS_vnd.o

                        arm-none-eabi-gcc.exe -mcpu=cortex-m3 -mthumb -I. -IGenerated_Source\PSoC5 -Wa,-alh=.\CortexM3\ARM_GCC_541\Debug/USBFS_midi.lst -g -Wall -ffunction-sections -ffat-lto-objects -O0 -c Generated_Source\PSoC5\USBFS_midi.c -o .\CortexM3\ARM_GCC_541\Debug\USBFS_midi.o

                        arm-none-eabi-gcc.exe -mcpu=cortex-m3 -mthumb -I. -IGenerated_Source\PSoC5 -Wa,-alh=.\CortexM3\ARM_GCC_541\Debug/USBFS_msc.lst -g -Wall -ffunction-sections -ffat-lto-objects -O0 -c Generated_Source\PSoC5\USBFS_msc.c -o .\CortexM3\ARM_GCC_541\Debug\USBFS_msc.o

                        arm-none-eabi-gcc.exe -mcpu=cortex-m3 -mthumb -I. -IGenerated_Source\PSoC5 -Wa,-alh=.\CortexM3\ARM_GCC_541\Debug/USBFS_Dm.lst -g -Wall -ffunction-sections -ffat-lto-objects -O0 -c Generated_Source\PSoC5\USBFS_Dm.c -o .\CortexM3\ARM_GCC_541\Debug\USBFS_Dm.o

                        arm-none-eabi-gcc.exe -mcpu=cortex-m3 -mthumb -I. -IGenerated_Source\PSoC5 -Wa,-alh=.\CortexM3\ARM_GCC_541\Debug/USBFS_Dp.lst -g -Wall -ffunction-sections -ffat-lto-objects -O0 -c Generated_Source\PSoC5\USBFS_Dp.c -o .\CortexM3\ARM_GCC_541\Debug\USBFS_Dp.o

                        arm-none-eabi-gcc.exe -mcpu=cortex-m3 -mthumb -I. -IGenerated_Source\PSoC5 -Wa,-alh=.\CortexM3\ARM_GCC_541\Debug/Cm3Start.lst -g -Wall -ffunction-sections -ffat-lto-objects -O0 -c Generated_Source\PSoC5\Cm3Start.c -o .\CortexM3\ARM_GCC_541\Debug\Cm3Start.o

                        arm-none-eabi-gcc.exe -mcpu=cortex-m3 -mthumb -I. -IGenerated_Source\PSoC5 -Wa,-alh=.\CortexM3\ARM_GCC_541\Debug/CyDmac.lst -g -Wall -ffunction-sections -ffat-lto-objects -O0 -c Generated_Source\PSoC5\CyDmac.c -o .\CortexM3\ARM_GCC_541\Debug\CyDmac.o

                        arm-none-eabi-gcc.exe -mcpu=cortex-m3 -mthumb -I. -IGenerated_Source\PSoC5 -Wa,-alh=.\CortexM3\ARM_GCC_541\Debug/CyFlash.lst -g -Wall -ffunction-sections -ffat-lto-objects -O0 -c Generated_Source\PSoC5\CyFlash.c -o .\CortexM3\ARM_GCC_541\Debug\CyFlash.o

                        arm-none-eabi-gcc.exe -mcpu=cortex-m3 -mthumb -I. -IGenerated_Source\PSoC5 -Wa,-alh=.\CortexM3\ARM_GCC_541\Debug/CyLib.lst -g -Wall -ffunction-sections -ffat-lto-objects -O0 -c Generated_Source\PSoC5\CyLib.c -o .\CortexM3\ARM_GCC_541\Debug\CyLib.o

                        arm-none-eabi-gcc.exe -mcpu=cortex-m3 -mthumb -I. -IGenerated_Source\PSoC5 -Wa,-alh=.\CortexM3\ARM_GCC_541\Debug/cyPm.lst -g -Wall -ffunction-sections -ffat-lto-objects -O0 -c Generated_Source\PSoC5\cyPm.c -o .\CortexM3\ARM_GCC_541\Debug\cyPm.o

                        arm-none-eabi-gcc.exe -mcpu=cortex-m3 -mthumb -I. -IGenerated_Source\PSoC5 -Wa,-alh=.\CortexM3\ARM_GCC_541\Debug/CySpc.lst -g -Wall -ffunction-sections -ffat-lto-objects -O0 -c Generated_Source\PSoC5\CySpc.c -o .\CortexM3\ARM_GCC_541\Debug\CySpc.o

                        arm-none-eabi-gcc.exe -mcpu=cortex-m3 -mthumb -I. -IGenerated_Source\PSoC5 -Wa,-alh=.\CortexM3\ARM_GCC_541\Debug/cyutils.lst -g -Wall -ffunction-sections -ffat-lto-objects -O0 -c Generated_Source\PSoC5\cyutils.c -o .\CortexM3\ARM_GCC_541\Debug\cyutils.o

                        arm-none-eabi-as.exe -mcpu=cortex-m3 -mthumb -I. -IGenerated_Source\PSoC5 -alh=.\CortexM3\ARM_GCC_541\Debug/CyBootAsmGnu.lst -g -o .\CortexM3\ARM_GCC_541\Debug\CyBootAsmGnu.o Generated_Source\PSoC5\CyBootAsmGnu.s

                        arm-none-eabi-ar.exe -rs ".\CortexM3\ARM_GCC_541\Debug\Project 1.a" .\CortexM3\ARM_GCC_541\Debug\USBFS.o .\CortexM3\ARM_GCC_541\Debug\USBFS_audio.o .\CortexM3\ARM_GCC_541\Debug\USBFS_boot.o .\CortexM3\ARM_GCC_541\Debug\USBFS_cdc.o .\CortexM3\ARM_GCC_541\Debug\USBFS_cls.o .\CortexM3\ARM_GCC_541\Debug\USBFS_descr.o .\CortexM3\ARM_GCC_541\Debug\USBFS_drv.o .\CortexM3\ARM_GCC_541\Debug\USBFS_episr.o .\CortexM3\ARM_GCC_541\Debug\USBFS_hid.o .\CortexM3\ARM_GCC_541\Debug\USBFS_pm.o .\CortexM3\ARM_GCC_541\Debug\USBFS_std.o .\CortexM3\ARM_GCC_541\Debug\USBFS_vnd.o .\CortexM3\ARM_GCC_541\Debug\USBFS_midi.o .\CortexM3\ARM_GCC_541\Debug\USBFS_msc.o .\CortexM3\ARM_GCC_541\Debug\USBFS_Dm.o .\CortexM3\ARM_GCC_541\Debug\USBFS_Dp.o .\CortexM3\ARM_GCC_541\Debug\CyDmac.o .\CortexM3\ARM_GCC_541\Debug\CyFlash.o .\CortexM3\ARM_GCC_541\Debug\CyLib.o .\CortexM3\ARM_GCC_541\Debug\cyPm.o .\CortexM3\ARM_GCC_541\Debug\CySpc.o .\CortexM3\ARM_GCC_541\Debug\cyutils.o .\CortexM3\ARM_GCC_541\Debug\CyBootAsmGnu.o

                        arm-none-eabi-ar.exe: creating .\CortexM3\ARM_GCC_541\Debug\Project 1.a

                        arm-none-eabi-gcc.exe -Wl,--start-group -o "C:\temp\PSOC 5\AN56377(PSoC Creator 3.0)\AN56377.cywrk.Archive01\AN56377\Project 1.cydsn\CortexM3\ARM_GCC_541\Debug\Project 1.elf" .\CortexM3\ARM_GCC_541\Debug\main.o .\CortexM3\ARM_GCC_541\Debug\cyfitter_cfg.o .\CortexM3\ARM_GCC_541\Debug\cymetadata.o .\CortexM3\ARM_GCC_541\Debug\Cm3Start.o ".\CortexM3\ARM_GCC_541\Debug\Project 1.a" "C:\Program Files (x86)\Cypress\PSoC Creator\4.1\PSoC Creator\psoc\content\cycomponentlibrary\CyComponentLibrary.cylib\CortexM3\ARM_GCC_541\Debug\CyComponentLibrary.a" -mcpu=cortex-m3 -mthumb -L Generated_Source\PSoC5 "-Wl,-Map,.\CortexM3\ARM_GCC_541\Debug/Project 1.map" -T Generated_Source\PSoC5\cm3gcc.ld -specs=nano.specs -Wl,--gc-sections -g -ffunction-sections -O0 -ffat-lto-objects -Wl,--end-group

                        cyelftool.exe -C "C:\temp\PSOC 5\AN56377(PSoC Creator 3.0)\AN56377.cywrk.Archive01\AN56377\Project 1.cydsn\CortexM3\ARM_GCC_541\Debug\Project 1.elf" --flash_row_size 256 --flash_size 262144 --flash_offset 0x00000000

                        cyelftool.exe -S "C:\temp\PSOC 5\AN56377(PSoC Creator 3.0)\AN56377.cywrk.Archive01\AN56377\Project 1.cydsn\CortexM3\ARM_GCC_541\Debug\Project 1.elf"

                        Flash used: 11030 of 262144 bytes (4.2 %).

                        SRAM used: 2725 of 65536 bytes (4.2 %). Stack: 2048 bytes. Heap: 128 bytes.

                        --------------- Build Succeeded: 08/29/2018 12:25:48 ---------------

                        • 9. Re: Updated version of AN56377
                          anks

                          "ADD: sdb.M0033: error: The instance 'LED_1', of component cy_pins_v2_5, contains an error. Unable to locate and customize component 'cy_pins_v2_5' used in schematic 'C:\temp\PSOC 5\AN56377(PSoC Creator 3.0)\AN56377.cywrk.Archive01\AN56377\Project 2.cydsn\TopDesign\TopDesign.cysch'.

                          *  (Component Update Tool)

                          * C:\temp\PSOC 5\AN56377(PSoC Creator 3.0)\AN56377.cywrk.Archive01\AN56377\Project 2.cydsn\TopDesign\TopDesign.cysch (Instance:LED_1)

                          ADD: sdb.M0033: error: The instance 'LED_2', of component cy_pins_v2_5, contains an error. Unable to locate and customize component 'cy_pins_v2_5' used in schematic 'C:\temp\PSOC 5\AN56377(PSoC Creator 3.0)\AN56377.cywrk.Archive01\AN56377\Project 2.cydsn\TopDesign\TopDesign.cysch'.

                          *  (Component Update Tool)"

                           

                          These error messages clearly indicate that the components  named LED_1 and LED_2  for  the  project2 are still not updated.

                          Please select and then right click the 2nd Project in the workspace and then chose option "Update Components" , Update Components tool will detect there are updates available to these components in Creator4.1, then press next to proceed with the update.

                          • 10. Re: Updated version of AN56377
                            rseedle_2385561

                            Yeah, right clicking the project and choosing to update the components worked.

                             

                            Randy